Alien-Build v2.75 Perl 5 v5.26.1 MSWin32-x64-multi-thread
- Status
- Fail
- From
- twata
- Dist
-
Alien-Build v2.75
- Platform
- Perl 5 v5.26.1 MSWin32-x64-multi-thread
- Date
- 2022-12-25 02:54:23
- ID
- c45f5e50-6d92-1014-9375-99f7efaa1848
This distribution has been tested as part of the CPAN Testers
project, supporting the Perl programming language. See
http://wiki.cpantesters.org/ for more information or email
questions to cpan-testers-discuss@perl.org
--
Dear Graham Ollis,
This is a computer-generated report for Alien-Build-2.75
on perl 5.26.1, created by CPAN-Reporter-1.2018.
Thank you for uploading your work to CPAN. However, there was a problem
testing your distribution.
If you think this report is invalid, please consult the CPAN Testers Wiki
for suggestions on how to avoid getting FAIL reports for missing library
or binary dependencies, unsupported operating systems, and so on:
http://wiki.cpantesters.org/wiki/CPANAuthorNotes
Sections of this report:
* Tester comments
* Program output
* Prerequisites
* Environment and other context
------------------------------
TESTER COMMENTS
------------------------------
Additional comments from tester:
none provided
------------------------------
PROGRAM OUTPUT
------------------------------
Output from 'c:\Strawberry\c\bin\gmake.exe test':
"C:\Strawberry\perl\bin\perl.exe" "-MExtUtils::Command::MM" "-MTest::Harness" "-e" "undef *Test::Harness::Switches; test_harness(0, 'blib\lib', 'blib\arch')" t/*.t
#
#
#
# HARNESS_ACTIVE=1
# HARNESS_VERSION=3.44
# PERL5LIB=C:\Strawberry\cpan\build\Alien-Build-2.75-0\blib\lib;C:\Strawberry\cpan\build\Alien-Build-2.75-0\blib\arch;C:\home\bathtub1\perl5\lib\perl5/5.26.1/MSWin32-x64-multi-thread;C:\home\bathtub1\perl5\lib\perl5/5.26.1;C:\home\bathtub1\perl5\lib\perl5/MSWin32-x64-multi-thread;C:\home\bathtub1\perl5\lib\perl5;C:\home\bathtub1\perl5\lib\perl5
# PERL5_CPANPLUS_IS_RUNNING=5604
# PERL5_CPAN_IS_RUNNING=5604
# PERL_LOCAL_LIB_ROOT=C:\home\bathtub1\perl5
# PERL_MB_OPT=--install_base "C:\\home\\bathtub1\\perl5"
# PERL_MM_OPT=INSTALL_BASE=C:\\home\\bathtub1\\perl5
# PERL_MM_USE_DEFAULT=1
# PERL_USE_UNSAFE_INC=1
#
#
#
# PERL5LIB path
# C:\Strawberry\cpan\build\Alien-Build-2.75-0\blib\lib
# C:\Strawberry\cpan\build\Alien-Build-2.75-0\blib\arch
# C:\home\bathtub1\perl5\lib\perl5/5.26.1/MSWin32-x64-multi-thread
# C:\home\bathtub1\perl5\lib\perl5/5.26.1
# C:\home\bathtub1\perl5\lib\perl5/MSWin32-x64-multi-thread
# C:\home\bathtub1\perl5\lib\perl5
# C:\home\bathtub1\perl5\lib\perl5
#
#
#
# perl 5.026001 MSWin32 MSWin32-x64-multi-thread
# Acme::Alien::DontPanic -
# Alien::Base::ModuleBuild 1.17
# Alien::Libbz2 -
# Alien::cmake3 0.08
# Alien::gzip -
# Alien::xz -
# Archive::Tar 2.36
# Archive::Zip 1.68
# Capture::Tiny 0.48
# Devel::Hide 0.0015
# Digest::SHA 6.03
# Env::ShellWords 0.02
# ExtUtils::CBuilder 0.280236
# ExtUtils::MakeMaker 7.6502
# ExtUtils::ParseXS 3.44
# FFI::CheckLib 0.31
# FFI::Platypus 2.05
# File::Listing 6.15
# File::Listing::Ftpcopy -
# File::Which 1.27
# File::chdir 0.1010
# HTML::Parser 3.80
# HTTP::Tiny 0.082
# IO::Compress::Bzip2 2.201
# IO::Socket::SSL 2.078
# IO::Uncompress::Bunzip2 2.201
# IO::Zlib 1.10
# JSON::PP 4.12
# LWP 6.67
# LWP::Protocol::https 6.10
# List::Util 1.63
# Mojo::DOM58 3.000
# Mojolicious 9.31
# Net::FTP 3.14
# Net::SSLeay 1.93_01
# Path::Tiny 0.144
# PkgConfig 0.25026
# PkgConfig::LibPkgConf -
# Plack 1.0050
# Readonly 2.05
# Sort::Versions 1.62
# Test2::API 1.302191
# Test2::V0 0.000145
# Text::ParseWords 3.31
# URI 5.17
# YAML 1.23
# parent 0.239
#
#
#
# ---
# cmake_generator: MinGW Makefiles
# compiler_type: unix
# cpu:
# arch:
# name: x86_64
# count: 4
# pkg-config:
# pkg-config: C:\home\bathtub1\perl5\bin\pkg-config.BAT
# pkgconf: ~
# system_type: windows-strawberry
# pkg-config negotiate pick = PkgConfig::PP
#
#
# [config.site]
# # file automatically generated by C:\Strawberry\cpan\build\Alien-Build-2.75-0\blib\lib/Alien/Build/Plugin/Build/Autoconf.pm
# libdir='${prefix}/lib'
#
#
#
t/00_diag.t .......................................... ok
t/01_use.t ........................................... ok
t/alien_base.t ....................................... ok
t/alien_base__system_installed.t ..................... ok
t/alien_base_pkgconfig.t ............................. ok
t/alien_base_wrapper.t ............................... ok
t/alien_build.t ...................................... ok
t/alien_build__download_rule.t ....................... ok
t/alien_build_commandsequence.t ...................... ok
t/alien_build_commandsequence__cd.t .................. ok
t/alien_build_interpolate.t .......................... ok
t/alien_build_interpolate_default.t .................. ok
t/alien_build_log.t .................................. ok
t/alien_build_log_abbreviate.t ....................... ok
t/alien_build_log_default.t .......................... ok
t/alien_build_meta.t ................................. ok
t/alien_build_mm.t ................................... ok
t/alien_build_plugin.t ............................... ok
t/alien_build_plugin_build_autoconf.t ................ ok
t/alien_build_plugin_build_cmake.t ................... ok
t/alien_build_plugin_build_copy.t .................... ok
t/alien_build_plugin_build_make.t .................... ok
t/alien_build_plugin_build_msys.t .................... ok
t/alien_build_plugin_build_searchdep.t ............... ok
t/alien_build_plugin_core_cleaninstall.t ............. ok
t/alien_build_plugin_core_download.t ................. ok
t/alien_build_plugin_core_ffi.t ...................... ok
t/alien_build_plugin_core_gather.t ................... ok
t/alien_build_plugin_core_legacy.t ................... ok
t/alien_build_plugin_core_override.t ................. ok
t/alien_build_plugin_core_setup.t .................... ok
t/alien_build_plugin_core_tail.t ..................... ok
t/alien_build_plugin_decode_dirlisting.t ............. ok
t/alien_build_plugin_decode_dirlistingftpcopy.t ...... ok
t/alien_build_plugin_decode_html.t ................... ok
t/alien_build_plugin_decode_mojo.t ................... ok
t/alien_build_plugin_digest_negotiate.t .............. ok
t/alien_build_plugin_digest_sha.t .................... ok
t/alien_build_plugin_digest_shapp.t .................. ok
t/alien_build_plugin_download_negotiate.t ............ ok
t/alien_build_plugin_extract_archivetar.t ............ ok
t/alien_build_plugin_extract_archivezip.t ............ ok
t/alien_build_plugin_extract_commandline.t ........... ok
t/alien_build_plugin_extract_commandline__tar_can.t .. ok
t/alien_build_plugin_extract_directory.t ............. ok
t/alien_build_plugin_extract_file.t .................. ok
t/alien_build_plugin_extract_negotiate.t ............. ok
t/alien_build_plugin_fetch_curlcommand.t ............. ok
t/alien_build_plugin_fetch_httptiny.t ................ ok
t/alien_build_plugin_fetch_local.t ................... ok
t/alien_build_plugin_fetch_localdir.t ................ ok
t/alien_build_plugin_fetch_lwp.t ..................... ok
t/alien_build_plugin_fetch_netftp.t .................. ok
t/alien_build_plugin_fetch_wget.t .................... skipped: No wget or not real wget
t/alien_build_plugin_gather_isolatedynamic.t ......... ok
t/alien_build_plugin_meta.t .......................... ok
t/alien_build_plugin_pkgconfig_commandline.t ......... skipped: use PkgConfig::PP on windows
t/alien_build_plugin_pkgconfig_libpkgconf.t .......... skipped: Test requires PkgConfig::LibPkgConf
t/alien_build_plugin_pkgconfig_makestatic.t .......... ok
t/alien_build_plugin_pkgconfig_negotiate.t ........... ok
t/alien_build_plugin_pkgconfig_negotiate__pick.t ..... ok
t/alien_build_plugin_pkgconfig_pp.t .................. ok
t/alien_build_plugin_prefer_badversion.t ............. ok
t/alien_build_plugin_prefer_goodversion.t ............ ok
t/alien_build_plugin_prefer_sortversions.t ........... ok
t/alien_build_plugin_probe_cbuilder.t ................ ok
t/alien_build_plugin_probe_cbuilder__live.t .......... skipped: CI only
t/alien_build_plugin_probe_commandline.t ............. ok
t/alien_build_plugin_probe_vcpkg.t ................... skipped: Test requires Win32::Vcpkg 0.02
t/alien_build_plugin_test_mock.t ..................... ok
t/alien_build_rc.t ................................... ok
t/alien_build_rc__prepostload.t ...................... ok
t/alien_build_rc__prepostload_plugin.t ............... ok
t/alien_build_temp.t ................................. ok
t/alien_build_tempdir.t .............................. ok
t/alien_build_util.t ................................. ok
t/alien_build_version_basic.t ........................ ok
t/alien_role.t ....................................... ok
t/alien_util.t ....................................... ok
t/alienfile.t ........................................ ok
C:/Strawberry/c/bin/../lib/gcc/x86_64-w64-mingw32/7.1.0/../../../../x86_64-w64-mingw32/bin/ld.exe: cannot open output file compilet.xs.dll: Permission denied
collect2.exe: error: ld returned 1 exit status
C:/Strawberry/c/bin/../lib/gcc/x86_64-w64-mingw32/7.1.0/../../../../x86_64-w64-mingw32/bin/ld.exe: cannot open output file compilet.xs.dll: Permission denied
collect2.exe: error: ld returned 1 exit status
C:/Strawberry/c/bin/../lib/gcc/x86_64-w64-mingw32/7.1.0/../../../../x86_64-w64-mingw32/bin/ld.exe: cannot open output file compilet.xs.dll: Permission denied
collect2.exe: error: ld returned 1 exit status
C:/Strawberry/c/bin/../lib/gcc/x86_64-w64-mingw32/7.1.0/../../../../x86_64-w64-mingw32/bin/ld.exe: cannot open output file compilet.xs.dll: Permission denied
collect2.exe: error: ld returned 1 exit status
# Failed test 'xs'
# at t/test_alien.t line 487.
# ExtUtils::CBuilder->link failed
# Generating script 'C:\Users\USER\AppData\Local\Temp\test-alien-ExkAHR\Mod0AAAA.lds'
# dlltool --def "C:\Users\USER\AppData\Local\Temp\test-alien-ExkAHR\Mod0AAAA.def" --output-exp "C:\Users\USER\AppData\Local\Temp\test-alien-ExkAHR\Mod0AAAA.exp"
# g++ -o "C:\Users\USER\AppData\Local\Temp\test-alien-ExkAHR\Mod0AAAA.xs.dll" -Wl,--base-file,"C:\Users\USER\AppData\Local\Temp\test-alien-ExkAHR\Mod0AAAA.base" -Wl,--enable-auto-image-base -mdll -s -L"c:\Strawberry\perl\lib\CORE" -L"c:\Strawberry\c\lib" "C:\Users\USER\AppData\Local\Temp\test-alien-ExkAHR\Mod0AAAA.lds" "C:\Users\USER\AppData\Local\Temp\test-alien-ExkAHR\Mod0AAAA.exp"
# dlltool --def "C:\Users\USER\AppData\Local\Temp\test-alien-ExkAHR\Mod0AAAA.def" --output-exp "C:\Users\USER\AppData\Local\Temp\test-alien-ExkAHR\Mod0AAAA.exp" --base-file "C:\Users\USER\AppData\Local\Temp\test-alien-ExkAHR\Mod0AAAA.base"
# g++ -o "C:\Users\USER\AppData\Local\Temp\test-alien-ExkAHR\Mod0AAAA.xs.dll" -Wl,--enable-auto-image-base -mdll -s -L"c:\Strawberry\perl\lib\CORE" -L"c:\Strawberry\c\lib" "C:\Users\USER\AppData\Local\Temp\test-alien-ExkAHR\Mod0AAAA.lds" "C:\Users\USER\AppData\Local\Temp\test-alien-ExkAHR\Mod0AAAA.exp"
# C:/Strawberry/c/bin/../lib/gcc/x86_64-w64-mingw32/7.1.0/../../../../x86_64-w64-mingw32/bin/ld.exe: cannot open output file C:\Users\USER\AppData\Local\Temp\test-alien-ExkAHR\Mod0AAAA.xs.dll: Permission denied
# collect2.exe: error: ld returned 1 exit status
# Failed test 'good'
# at t/test_alien.t line 496.
# Failed test 'xs_ok'
# at t/test_alien.t line 598.
t/test_alien.t .......................................
Dubious, test returned 1 (wstat 256, 0x100)
Failed 1/11 subtests
t/test_alien_build.t ................................. ok
t/test_alien_cancompile.t ............................ ok
Devel::Hide hides FFI/Platypus.pm
t/test_alien_canplatypus.t ........................... ok
t/test_alien_diag.t .................................. ok
t/test_alien_run.t ................................... ok
t/test_alien_synthetic.t ............................. ok
Test Summary Report
-------------------
t/test_alien.t (Wstat: 256 (exited 1) Tests: 11 Failed: 1)
Failed test: 6
Non-zero exit status: 1
Files=87, Tests=439, 180 wallclock secs ( 0.58 usr + 0.23 sys = 0.81 CPU)
Result: FAIL
Failed 1/87 test programs. 1/439 subtests failed.
gmake: *** [Makefile:988: test_dynamic] Error 255
------------------------------
PREREQUISITES
------------------------------
Prerequisite modules loaded:
requires:
Module Need Have
------------------- -------- --------
Capture::Tiny 0.17 0.48
Digest::SHA 0 6.03
ExtUtils::CBuilder 0 0.280236
ExtUtils::MakeMaker 6.64 7.65_02
ExtUtils::ParseXS 3.30 3.44
FFI::CheckLib 0.11 0.31
File::chdir 0 0.1010
File::Which 1.10 1.27
JSON::PP 0 4.12
List::Util 1.33 1.63
parent 0 0.239
Path::Tiny 0.077 0.144
perl 5.008004 5.026001
PkgConfig 0.14026 0.25026
Test2::API 1.302096 1.302191
Text::ParseWords 3.26 3.31
build_requires:
Module Need Have
------------------- -------- --------
ExtUtils::MakeMaker 6.64 7.65_02
Test2::API 1.302096 1.302191
Test2::V0 0.000121 0.000145
configure_requires:
Module Need Have
------------------- -------- --------
ExtUtils::CBuilder 0 0.280236
ExtUtils::MakeMaker 6.64 7.65_02
ExtUtils::ParseXS 3.30 3.44
File::Which 0 1.27
perl 5.008004 5.026001
------------------------------
ENVIRONMENT AND OTHER CONTEXT
------------------------------
Environment variables:
COMSPEC = C:\WINDOWS\system32\cmd.exe
NONINTERACTIVE_TESTING = 1
NUMBER_OF_PROCESSORS = 4
PATH = C:\home\bathtub1\perl5\bin;C:\WINDOWS\system32;C:\WINDOWS;C:\WINDOWS\System32\Wbem;C:\WINDOWS\System32\WindowsPowerShell\v1.0\;C:\Strawberry\c\bin;C:\Strawberry\perl\site\bin;C:\Strawberry\perl\bin
PERL5LIB = C:\home\bathtub1\perl5\lib\perl5
PERL5OPT =
PERL5_CPANPLUS_IS_RUNNING = 5604
PERL5_CPAN_IS_RUNNING = 5604
PERL_LOCAL_LIB_ROOT = C:\home\bathtub1\perl5
PERL_MB_OPT = --install_base "C:\\home\\bathtub1\\perl5"
PERL_MM_OPT = INSTALL_BASE=C:\\home\\bathtub1\\perl5
PERL_MM_USE_DEFAULT = 1
PERL_USE_UNSAFE_INC = 1
PROCESSOR_IDENTIFIER = Intel64 Family 6 Model 58 Stepping 9, GenuineIntel
TEMP = C:\Users\USER\AppData\Local\Temp
TERM = dumb
Perl special variables (and OS-specific diagnostics, for MSWin32):
$^X = C:\Strawberry\perl\bin\perl.exe
$UID/$EUID = 0 / 0
$GID = 0
$EGID = 0
Win32::GetOSName = Win8.1
Win32::GetOSVersion = , 6, 3, 9600, 2, 0, 0, 256, 1
Win32::FsType = NTFS
Win32::IsAdminUser = 0
Perl module toolchain versions installed:
Module Have
------------------- --------
CPAN 2.34
CPAN::Meta 2.150010
Cwd 3.75
ExtUtils::CBuilder 0.280236
ExtUtils::Command 7.65_02
ExtUtils::Install 2.20
ExtUtils::MakeMaker 7.65_02
ExtUtils::Manifest 1.73
ExtUtils::ParseXS 3.44
File::Spec 3.75
JSON 4.10
JSON::PP 4.12
Module::Build 0.4232
Module::Signature 0.88
Parse::CPAN::Meta 2.150010
Test::Harness 3.44
Test::More 1.302191
YAML 1.23
YAML::Syck 1.34
version 0.9929
--
Summary of my perl5 (revision 5 version 26 subversion 1) configuration:
Platform:
osname=MSWin32
osvers=6.3
archname=MSWin32-x64-multi-thread
uname='Win32 strawberry-perl 5.26.1.1 #1 Sun Sep 24 05:32:33 2017 x64'
config_args='undef'
hint=recommended
useposix=true
d_sigaction=undef
useithreads=define
usemultiplicity=define
use64bitint=define
use64bitall=undef
uselongdouble=undef
usemymalloc=n
default_inc_excludes_dot=define
bincompat5005=undef
Compiler:
cc='gcc'
ccflags =' -s -O2 -DWIN32 -DWIN64 -DCONSERVATIVE -D__USE_MINGW_ANSI_STDIO -DPERL_TEXTMODE_SCRIPTS -DPERL_IMPLICIT_CONTEXT -DPERL_IMPLICIT_SYS -DUSE_PERLIO -fwrapv -fno-strict-aliasing -mms-bitfields'
optimize='-s -O2'
cppflags='-DWIN32'
ccversion=''
gccversion='7.1.0'
gccosandvers=''
intsize=4
longsize=4
ptrsize=8
doublesize=8
byteorder=12345678
doublekind=3
d_longlong=define
longlongsize=8
d_longdbl=define
longdblsize=16
longdblkind=3
ivtype='long long'
ivsize=8
nvtype='double'
nvsize=8
Off_t='long long'
lseeksize=8
alignbytes=8
prototype=define
Linker and Libraries:
ld='g++'
ldflags ='-s -L"c:\Strawberry\perl\lib\CORE" -L"c:\Strawberry\c\lib"'
libpth=c:\Strawberry\c\lib c:\Strawberry\c\x86_64-w64-mingw32\lib c:\Strawberry\c\lib\gcc\x86_64-w64-mingw32\7.1.0
libs= -lmoldname -lkernel32 -luser32 -lgdi32 -lwinspool -lcomdlg32 -ladvapi32 -lshell32 -lole32 -loleaut32 -lnetapi32 -luuid -lws2_32 -lmpr -lwinmm -lversion -lodbc32 -lodbccp32 -lcomctl32
perllibs= -lmoldname -lkernel32 -luser32 -lgdi32 -lwinspool -lcomdlg32 -ladvapi32 -lshell32 -lole32 -loleaut32 -lnetapi32 -luuid -lws2_32 -lmpr -lwinmm -lversion -lodbc32 -lodbccp32 -lcomctl32
libc=
so=dll
useshrplib=true
libperl=libperl526.a
gnulibc_version=''
Dynamic Linking:
dlsrc=dl_win32.xs
dlext=xs.dll
d_dlsymun=undef
ccdlflags=' '
cccdlflags=' '
lddlflags='-mdll -s -L"c:\Strawberry\perl\lib\CORE" -L"c:\Strawberry\c\lib"'
Characteristics of this binary (from libperl):
Compile-time options:
HAS_TIMES
HAVE_INTERP_INTERN
MULTIPLICITY
PERLIO_LAYERS
PERL_COPY_ON_WRITE
PERL_DONT_CREATE_GVSV
PERL_IMPLICIT_CONTEXT
PERL_IMPLICIT_SYS
PERL_MALLOC_WRAP
PERL_OP_PARENT
PERL_PRESERVE_IVUV
USE_64_BIT_INT
USE_ITHREADS
USE_LARGE_FILES
USE_LOCALE
USE_LOCALE_COLLATE
USE_LOCALE_CTYPE
USE_LOCALE_NUMERIC
USE_LOCALE_TIME
USE_PERLIO
USE_PERL_ATOF
Built under MSWin32
Compiled at Sep 24 2017 05:47:34
%ENV:
PERL5LIB="C:\home\bathtub1\perl5\lib\perl5"
PERL5_CPANPLUS_IS_RUNNING="5604"
PERL5_CPAN_IS_RUNNING="5604"
PERL_LOCAL_LIB_ROOT="C:\home\bathtub1\perl5"
PERL_MB_OPT="--install_base "C:\\home\\bathtub1\\perl5""
PERL_MM_OPT="INSTALL_BASE=C:\\home\\bathtub1\\perl5"
PERL_MM_USE_DEFAULT="1"
PERL_USE_UNSAFE_INC="1"
@INC:
C:\home\bathtub1\perl5\lib\perl5/5.26.1/MSWin32-x64-multi-thread
C:\home\bathtub1\perl5\lib\perl5/5.26.1
C:\home\bathtub1\perl5\lib\perl5/MSWin32-x64-multi-thread
C:\home\bathtub1\perl5\lib\perl5
C:/Strawberry/perl/site/lib
C:/Strawberry/perl/vendor/lib
C:/Strawberry/perl/lib
.